BDBM50140666 (2S,5R,6S)-6-Mercaptomethyl-3,3-dimethyl-4,4,7-trioxo-4lambda*6*-thia-1-aza-bicyclo[3.2.0]heptane-2-carboxylic acid::CHEMBL25766
SMILES CC1(C)[C@@H](N2[C@@H]([C@H](CS)C2=O)S1(=O)=O)C(O)=O
InChI Key InChIKey=MQNFPHMTROMTJB-JCGDXUMPSA-N
Data  4 IC50
  Tab Delimited (TSV)   2D SDfile   Computed 3D by Vconf -m prep SDfile
Find this compound or compounds like it in BindingDB:
Activity Spreadsheet -- Enzyme Inhibition Constant Data from BindingDB
Found 1 hit for monomerid = 50140666
TargetMetallo-beta-lactamase L1 type 3(Stenotrophomonas maltophilia)
Southern Methodist University
Curated by ChEMBL
LigandPNGBDBM50140666((2S,5R,6S)-6-Mercaptomethyl-3,3-dimethyl-4,4,7-tri...)
Affinity DataIC50:  100nM. Assay description: Inhibition of class B (BCII) metallo-beta-lactamase representative enzyme
In DepthDetails ArticlePubMed